{"text_format":"1","workbook":"xlsx","n_sheets":3,"sheets":["Hoja1","Proyectos vigentes","NOTA"],"not_rendered":{"charts":0,"images":0,"macros":1,"external_links":0,"defined_names":4,"comments":0,"pivot_tables":0},"unopened":[],"bounds":{"document_bytes":16777216,"sheet_cells":100000,"rows_first":2000,"rows_last":500,"rows_between":2000,"halvings":0,"cell_chars":16384,"cell_head_chars":4096},"cells_cut":0,"cells_raw":0,"read":"whole","date_system":"1900"}

{"sheet":"Hoja1","index":0,"n_rows":550,"n_cols":13,"rows_kept":550,"cut":false,"hidden":true,"merged":[]}
[null,"No.","NUM. REG.","DEPENDENCIA","CARRERA","NOMBRE DEL PROYECTO","ASESOR (ES)","TELEFONO"]
[{"$f":"COUNTIF($E$1:E2,'Proyectos vigentes'!$C$4)","v":0},1,52,"Alcaldía Gustavo A. Madero","Civil","Infraestructura urbana y servicios públicos","Lic. Oscar José Ramírez Rojas                 Lic. María Elena Pelayo Maldonado               ","55 51182800 EXT. 6209 y 6211",null,null,null,null,"Ambiental"]
[{"$f":"COUNTIF($E$1:E3,'Proyectos vigentes'!$C$4)","v":0},2,52,"Alcaldía Gustavo A. Madero","Eléctrica","Infraestructura urbana y servicios públicos","Lic. Oscar José Ramírez Rojas                 Lic. María Elena Pelayo Maldonado               ","55 51182800 EXT. 6209 y 6211",null,null,null,null,"Civil"]
[{"$f":"COUNTIF($E$1:E4,'Proyectos vigentes'!$C$4)","v":0},3,55,"Alcaldía Gustavo A. Madero","Electrónica","Tecnologías de la información","Lic. Oscar José Ramírez Rojas                 Lic. María Elena Pelayo Maldonado               ","55 51182800 EXT. 6209 y 6211",null,null,null,null,"Computación"]
[{"$f":"COUNTIF($E$1:E5,'Proyectos vigentes'!$C$4)","v":0},4,55,"Alcaldía Gustavo A. Madero","Computación","Tecnologías de la información","Lic. Oscar José Ramírez Rojas                 Lic. María Elena Pelayo Maldonado               ","55 51182800 EXT. 6209 y 6211",null,null,null,null,"Eléctrica"]
[{"$f":"COUNTIF($E$1:E6,'Proyectos vigentes'!$C$4)","v":0},5,56,"Alcaldía Gustavo A. Madero","Ambiental","Transformación del entorno urbano","Lic. Oscar José Ramírez Rojas                 Lic. María Elena Pelayo Maldonado               ","55 51182800 EXT. 6209 y 6211",null,null,null,null,"Electrónica"]
[{"$f":"COUNTIF($E$1:E7,'Proyectos vigentes'!$C$4)","v":0},6,60,"Instituto Mexicano del Petróleo","Ambiental","Formación y desarrollo del factor humano del IMP","M. en C. María Guadalupe Alvarado Maldonado","9175-6373",null,null,null,null,"Física "]
[{"$f":"COUNTIF($E$1:E8,'Proyectos vigentes'!$C$4)","v":0},7,60,"Instituto Mexicano del Petróleo","Civil","Formación y desarrollo del factor humano del IMP","M. en C. María Guadalupe Alvarado Maldonado","9175-6373",null,null,null,null,"Industrial"]
[{"$f":"COUNTIF($E$1:E9,'Proyectos vigentes'!$C$4)","v":0},8,60,"Instituto Mexicano del Petróleo","Eléctrica","Formación y desarrollo del factor humano del IMP","M. en C. María Guadalupe Alvarado Maldonado","9175-6373",null,null,null,null,"Mecánica"]
[{"$f":"COUNTIF($E$1:E10,'Proyectos vigentes'!$C$4)","v":0},9,60,"Instituto Mexicano del Petróleo","Electrónica","Formación y desarrollo del factor humano del IMP","M. en C. María Guadalupe Alvarado Maldonado","9175-6373",null,null,null,null,"Metalúrgica"]
[{"$f":"COUNTIF($E$1:E11,'Proyectos vigentes'!$C$4)","v":0},10,60,"Instituto Mexicano del Petróleo","Computación","Formación y desarrollo del factor humano del IMP","M. en C. María Guadalupe Alvarado Maldonado","9175-6373",null,null,null,null,"Química"]
[{"$f":"COUNTIF($E$1:E12,'Proyectos vigentes'!$C$4)","v":0},11,60,"Instituto Mexicano del Petróleo","Física ","Formación y desarrollo del factor humano del IMP","M. en C. María Guadalupe Alvarado Maldonado","9175-6373",null,null,null,null,"Todas las carreras CBI"]
[{"$f":"COUNTIF($E$1:E13,'Proyectos vigentes'!$C$4)","v":0},12,60,"Instituto Mexicano del Petróleo","Industrial","Formación y desarrollo del factor humano del IMP","M. en C. María Guadalupe Alvarado Maldonado","9175-6373"]
[{"$f":"COUNTIF($E$1:E14,'Proyectos vigentes'!$C$4)","v":1},13,60,"Instituto Mexicano del Petróleo","Mecánica","Formación y desarrollo del factor humano del IMP","M. en C. María Guadalupe Alvarado Maldonado","9175-6373"]
[{"$f":"COUNTIF($E$1:E15,'Proyectos vigentes'!$C$4)","v":1},14,60,"Instituto Mexicano del Petróleo","Química","Formación y desarrollo del factor humano del IMP","M. en C. María Guadalupe Alvarado Maldonado","9175-6373"]
[{"$f":"COUNTIF($E$1:E16,'Proyectos vigentes'!$C$4)","v":1},15,85,"Alcaldía Gustavo A. Madero","Industrial","Modernización administrativa","Lic. Javier Sánchez Camacho                 Lic. María Elena Pelayo Maldonado               ","55 51182800 EXT:2115 Y 2107"]
[{"$f":"COUNTIF($E$1:E17,'Proyectos vigentes'!$C$4)","v":1},16,179,"Alcaldía Gustavo A. Madero","Industrial","Fomento a la micro y pequeña empresa","Lic. Javier Sánchez Camacho                 Lic. María Elena Pelayo Maldonado               ","55 51182800    EXT. 2114 y 2115"]
[{"$f":"COUNTIF($E$1:E18,'Proyectos vigentes'!$C$4)","v":1},17,179,"Alcaldía Gustavo A. Madero","Química","Fomento a la micro y pequeña empresa","Lic. Javier Sánchez Camacho                 Lic. María Elena Pelayo Maldonado               ","55 51182800    EXT. 2114 y 2115"]
[{"$f":"COUNTIF($E$1:E19,'Proyectos vigentes'!$C$4)","v":1},18,180,"Alcaldía Gustavo A. Madero","Industrial","Atención a la comunidad","Lic. Javier Sánchez Camacho                 Lic. María Elena Pelayo Maldonado               ","55  51182800    EXT. 2115 Y 2107"]
[{"$f":"COUNTIF($E$1:E20,'Proyectos vigentes'!$C$4)","v":1},19,285,"Secretaría de Medio Ambiente y Recursos Naturales","Ambiental","Educación Superior y Conservación del Medio Ambiente","Lic. Claudia Anel Guerrero Martín,       Lic. José Pablo J. Sósol Morgado","5490-2100 ext. 14568"]
[{"$f":"COUNTIF($E$1:E21,'Proyectos vigentes'!$C$4)","v":1},20,285,"Secretaría de Medio Ambiente y Recursos Naturales","Computación","Educación Superior y Conservación del Medio Ambiente","Lic. Claudia Anel Guerrero Martín,       Lic. José Pablo J. Sósol Morgado","5490-2100 ext. 14568"]
[{"$f":"COUNTIF($E$1:E22,'Proyectos vigentes'!$C$4)","v":1},21,361,"Sistema de Transporte Colectivo (Metro)","Computación","Mantenimiento preventivo y correctivo a las instalaciones que conforman la operatividad del S. T. C. ","Lic. Carlos Enrique Gómez Alonso","5709-1133 ext. 2546, 2547"]
[{"$f":"COUNTIF($E$1:E23,'Proyectos vigentes'!$C$4)","v":1},22,361,"Sistema de Transporte Colectivo (Metro)","Eléctrica","Mantenimiento preventivo y correctivo a las instalaciones que conforman la operatividad del S. T. C. ","Lic. Carlos Enrique Gómez Alonso","5709-1133 ext. 2546, 2547"]
[{"$f":"COUNTIF($E$1:E24,'Proyectos vigentes'!$C$4)","v":1},23,361,"Sistema de Transporte Colectivo (Metro)","Electrónica","Mantenimiento preventivo y correctivo a las instalaciones que conforman la operatividad del S. T. C. ","Lic. Carlos Enrique Gómez Alonso","5709-1133 ext. 2546, 2547"]
[{"$f":"COUNTIF($E$1:E25,'Proyectos vigentes'!$C$4)","v":1},24,361,"Sistema de Transporte Colectivo (Metro)","Industrial","Mantenimiento preventivo y correctivo a las instalaciones que conforman la operatividad del S. T. C. ","Lic. Carlos Enrique Gómez Alonso","5709-1133 ext. 2546, 2547"]
[{"$f":"COUNTIF($E$1:E26,'Proyectos vigentes'!$C$4)","v":2},25,361,"Sistema de Transporte Colectivo (Metro)","Mecánica","Mantenimiento preventivo y correctivo a las instalaciones que conforman la operatividad del S. T. C. ","Lic. Carlos Enrique Gómez Alonso","5709-1133 ext. 2546, 2547"]
[{"$f":"COUNTIF($E$1:E27,'Proyectos vigentes'!$C$4)","v":2},26,361,"Sistema de Transporte Colectivo (Metro)","Civil","Mantenimiento preventivo y correctivo a las instalaciones que conforman la operatividad del S. T. C. ","Lic. Carlos Enrique Gómez Alonso","5709-1133 ext. 2546, 2547"]
[{"$f":"COUNTIF($E$1:E28,'Proyectos vigentes'!$C$4)","v":2},27,378,"Alcaldía Benito Juárez","Civil","Protección, Conservación y Mejoramiento de Obras Públicas y Desarrollo Urbano","C. Jesús Velázquez Morán","55-5422-5300"]
[{"$f":"COUNTIF($E$1:E29,'Proyectos vigentes'!$C$4)","v":2},28,"829-396","Petróleos Mexicanos ","Ambiental","PROSER Capital Humano","Ing. María Esther Torruco Ruiz                      ","1944-2500 ext. 37771"]
[{"$f":"COUNTIF($E$1:E30,'Proyectos vigentes'!$C$4)","v":2},29,"829-396","Petróleos Mexicanos ","Civil","PROSER Capital Humano","Ing. María Esther Torruco Ruiz                      ","1944-2500 ext. 37771"]
{"$rows_left_out":521}
{"sheet":"Proyectos vigentes","index":1,"n_rows":904,"n_cols":7,"rows_kept":904,"cut":false,"hidden":false,"merged":[[1,0,1,6],[3,0,3,1],[3,2,3,3],[2,5,2,6],[3,5,3,6]]}
[]
["PROYECTOS DE SERVICIO SOCIAL VIGENTES"]
[null,null,null,null,null,"Última Actualización: 15 de abril de 2024"]
["Ingeniería",null,"Mecánica"]
[]
[]
["No.","NUM. REG.","DEPENDENCIA","CARRERA","NOMBRE DEL PROYECTO","ASESOR (ES)","TELEFONO"]
[1,{"$f":"VLOOKUP(A8,Hoja1!$A$1:$H$578,3,FALSE)","v":60},{"$f":"IFERROR(VLOOKUP(A8,Hoja1!$A$1:$H$578,4,FALSE),\" \")","v":"Instituto Mexicano del Petróleo"},{"$f":"IFERROR(VLOOKUP(A8,Hoja1!$A$1:$H$578,5,FALSE),\" \")","v":"Mecánica"},{"$f":"IFERROR(VLOOKUP(A8,Hoja1!$A$1:$H$578,6,FALSE),\" \")","v":"Formación y desarrollo del factor humano del IMP"},{"$f":"IFERROR(VLOOKUP(A8,Hoja1!$A$1:$H$578,7,FALSE),\" \")","v":"M. en C. María Guadalupe Alvarado Maldonado"},{"$f":"IFERROR(VLOOKUP(A8,Hoja1!$A$1:$H$578,8,FALSE),\" \")","v":"9175-6373"}]
[2,{"$f":"VLOOKUP(A9,Hoja1!$A$1:$H$578,3,FALSE)","v":361},{"$f":"IFERROR(VLOOKUP(A9,Hoja1!$A$1:$H$578,4,FALSE),\" \")","v":"Sistema de Transporte Colectivo (Metro)"},{"$f":"IFERROR(VLOOKUP(A9,Hoja1!$A$1:$H$578,5,FALSE),\" \")","v":"Mecánica"},{"$f":"IFERROR(VLOOKUP(A9,Hoja1!$A$1:$H$578,6,FALSE),\" \")","v":"Mantenimiento preventivo y correctivo a las instalaciones que conforman la operatividad del S. T. C. "},{"$f":"IFERROR(VLOOKUP(A9,Hoja1!$A$1:$H$578,7,FALSE),\" \")","v":"Lic. Carlos Enrique Gómez Alonso"},{"$f":"IFERROR(VLOOKUP(A9,Hoja1!$A$1:$H$578,8,FALSE),\" \")","v":"5709-1133 ext. 2546, 2547"}]
[3,{"$f":"VLOOKUP(A10,Hoja1!$A$1:$H$578,3,FALSE)","v":"829-396"},{"$f":"IFERROR(VLOOKUP(A10,Hoja1!$A$1:$H$578,4,FALSE),\" \")","v":"Petróleos Mexicanos "},{"$f":"IFERROR(VLOOKUP(A10,Hoja1!$A$1:$H$578,5,FALSE),\" \")","v":"Mecánica"},{"$f":"IFERROR(VLOOKUP(A10,Hoja1!$A$1:$H$578,6,FALSE),\" \")","v":"PROSER Capital Humano"},{"$f":"IFERROR(VLOOKUP(A10,Hoja1!$A$1:$H$578,7,FALSE),\" \")","v":"Ing. María Esther Torruco Ruiz                      "},{"$f":"IFERROR(VLOOKUP(A10,Hoja1!$A$1:$H$578,8,FALSE),\" \")","v":"1944-2500 ext. 37771"}]
[4,{"$f":"VLOOKUP(A11,Hoja1!$A$1:$H$578,3,FALSE)","v":"830-065"},{"$f":"IFERROR(VLOOKUP(A11,Hoja1!$A$1:$H$578,4,FALSE),\" \")","v":"Instituto Mexicano de la Construcción en Acero (IMCA)"},{"$f":"IFERROR(VLOOKUP(A11,Hoja1!$A$1:$H$578,5,FALSE),\" \")","v":"Mecánica"},{"$f":"IFERROR(VLOOKUP(A11,Hoja1!$A$1:$H$578,6,FALSE),\" \")","v":"Diseño, fabricación, montaje y supervisión de estructuras de acero"},{"$f":"IFERROR(VLOOKUP(A11,Hoja1!$A$1:$H$578,7,FALSE),\" \")","v":"Ing. Octavio Álvarez Valadez                 Dr. Tiziano Perea Olvera."},{"$f":"IFERROR(VLOOKUP(A11,Hoja1!$A$1:$H$578,8,FALSE),\" \")","v":"55-5572-3196"}]
[5,{"$f":"VLOOKUP(A12,Hoja1!$A$1:$H$578,3,FALSE)","v":"829-435"},{"$f":"IFERROR(VLOOKUP(A12,Hoja1!$A$1:$H$578,4,FALSE),\" \")","v":"Secretaría de Seguridad Ciudadana de la Ciudad de México (SSC CDMX)"},{"$f":"IFERROR(VLOOKUP(A12,Hoja1!$A$1:$H$578,5,FALSE),\" \")","v":"Mecánica"},{"$f":"IFERROR(VLOOKUP(A12,Hoja1!$A$1:$H$578,6,FALSE),\" \")","v":"Apoyo en actividades de infraestructura y de tecnología de la SSC CDMX"},{"$f":"IFERROR(VLOOKUP(A12,Hoja1!$A$1:$H$578,7,FALSE),\" \")","v":"Lic. Juan de Dios Maciel Pérez                  Lic. Luis Javier Ramírez Reyes."},{"$f":"IFERROR(VLOOKUP(A12,Hoja1!$A$1:$H$578,8,FALSE),\" \")","v":"55-5132-5400 ext. 1314"}]
[6,{"$f":"VLOOKUP(A13,Hoja1!$A$1:$H$578,3,FALSE)","v":"829-443"},{"$f":"IFERROR(VLOOKUP(A13,Hoja1!$A$1:$H$578,4,FALSE),\" \")","v":"Financiera para el Bienestar"},{"$f":"IFERROR(VLOOKUP(A13,Hoja1!$A$1:$H$578,5,FALSE),\" \")","v":"Mecánica"},{"$f":"IFERROR(VLOOKUP(A13,Hoja1!$A$1:$H$578,6,FALSE),\" \")","v":"Apoyo Administrativo en Telecomm"},{"$f":"IFERROR(VLOOKUP(A13,Hoja1!$A$1:$H$578,7,FALSE),\" \")","v":"Lic. Karla Beatriz Dávila García,         Mtro. Carlos Fernando Roldán Zarate"},{"$f":"IFERROR(VLOOKUP(A13,Hoja1!$A$1:$H$578,8,FALSE),\" \")","v":"5550901100 ext.1202"}]
[7,{"$f":"VLOOKUP(A14,Hoja1!$A$1:$H$578,3,FALSE)","v":"829-447"},{"$f":"IFERROR(VLOOKUP(A14,Hoja1!$A$1:$H$578,4,FALSE),\" \")","v":"Red de Transporte de pasajeros de la Ciudad de México"},{"$f":"IFERROR(VLOOKUP(A14,Hoja1!$A$1:$H$578,5,FALSE),\" \")","v":"Mecánica"},{"$f":"IFERROR(VLOOKUP(A14,Hoja1!$A$1:$H$578,6,FALSE),\" \")","v":"Servicio Social para la administración Integral de la Red de Transporte de pasajeros de la Ciudad de México"},{"$f":"IFERROR(VLOOKUP(A14,Hoja1!$A$1:$H$578,7,FALSE),\" \")","v":"C. P. Tania Edith Reyes Varela                Lic. Lucia Paola Carrillo Olvera                                       Lic. Valeria Jacqueline Ávila Arias                                      Lic. Elliots Luis Miranda León"},{"$f":"IFERROR(VLOOKUP(A14,Hoja1!$A$1:$H$578,8,FALSE),\" \")","v":"55-1328-6300 ext. 6423, 6387"}]
[8,{"$f":"VLOOKUP(A15,Hoja1!$A$1:$H$578,3,FALSE)","v":964},{"$f":"IFERROR(VLOOKUP(A15,Hoja1!$A$1:$H$578,4,FALSE),\" \")","v":"UAM"},{"$f":"IFERROR(VLOOKUP(A15,Hoja1!$A$1:$H$578,5,FALSE),\" \")","v":"Mecánica"},{"$f":"IFERROR(VLOOKUP(A15,Hoja1!$A$1:$H$578,6,FALSE),\" \")","v":"Simulación y análisis experimental en energía solar."},{"$f":"IFERROR(VLOOKUP(A15,Hoja1!$A$1:$H$578,7,FALSE),\" \")","v":"Hilario Terres Peña"},{"$f":"IFERROR(VLOOKUP(A15,Hoja1!$A$1:$H$578,8,FALSE),\" \")","v":"5318-9061"}]
[9,{"$f":"VLOOKUP(A16,Hoja1!$A$1:$H$578,3,FALSE)","v":991},{"$f":"IFERROR(VLOOKUP(A16,Hoja1!$A$1:$H$578,4,FALSE),\" \")","v":"UAM"},{"$f":"IFERROR(VLOOKUP(A16,Hoja1!$A$1:$H$578,5,FALSE),\" \")","v":"Mecánica"},{"$f":"IFERROR(VLOOKUP(A16,Hoja1!$A$1:$H$578,6,FALSE),\" \")","v":"Operación de la planta piloto de tratamiento de aguas residuales de la UAM-A."},{"$f":"IFERROR(VLOOKUP(A16,Hoja1!$A$1:$H$578,7,FALSE),\" \")","v":"Dr. Israel Labastida Núñez                    M. en C. I. Margarita Beltrán Villavicencio                     Dra. Maribel Velasco Pérez                 Dr. Jaime Alejandro Paulino Granados Samaniego"},{"$f":"IFERROR(VLOOKUP(A16,Hoja1!$A$1:$H$578,8,FALSE),\" \")","v":"55-5318-9075 "}]
[10,{"$f":"VLOOKUP(A17,Hoja1!$A$1:$H$578,3,FALSE)","v":816},{"$f":"IFERROR(VLOOKUP(A17,Hoja1!$A$1:$H$578,4,FALSE),\" \")","v":"UAM"},{"$f":"IFERROR(VLOOKUP(A17,Hoja1!$A$1:$H$578,5,FALSE),\" \")","v":"Mecánica"},{"$f":"IFERROR(VLOOKUP(A17,Hoja1!$A$1:$H$578,6,FALSE),\" \")","v":"Apoyo al Programa Interno de Protección Civil  de la UAM-Azcapotzalco."},{"$f":"IFERROR(VLOOKUP(A17,Hoja1!$A$1:$H$578,7,FALSE),\" \")","v":"Ing. Roberto Carlos Vázquez Solís      Dra. Rosa María Espinosa Valdemar "},{"$f":"IFERROR(VLOOKUP(A17,Hoja1!$A$1:$H$578,8,FALSE),\" \")","v":"555318-9545"}]
[11,{"$f":"VLOOKUP(A18,Hoja1!$A$1:$H$578,3,FALSE)","v":1076},{"$f":"IFERROR(VLOOKUP(A18,Hoja1!$A$1:$H$578,4,FALSE),\" \")","v":"UAM"},{"$f":"IFERROR(VLOOKUP(A18,Hoja1!$A$1:$H$578,5,FALSE),\" \")","v":"Mecánica"},{"$f":"IFERROR(VLOOKUP(A18,Hoja1!$A$1:$H$578,6,FALSE),\" \")","v":"P.G.I.R.S. de la UAM-Azcapotzalco SEPARACCIÓN"},{"$f":"IFERROR(VLOOKUP(A18,Hoja1!$A$1:$H$578,7,FALSE),\" \")","v":"Dra. Rosa María Espinosa Valdemar"},{"$f":"IFERROR(VLOOKUP(A18,Hoja1!$A$1:$H$578,8,FALSE),\" \")","v":"5318-9062"}]
[12,{"$f":"VLOOKUP(A19,Hoja1!$A$1:$H$578,3,FALSE)","v":1107},{"$f":"IFERROR(VLOOKUP(A19,Hoja1!$A$1:$H$578,4,FALSE),\" \")","v":"UAM"},{"$f":"IFERROR(VLOOKUP(A19,Hoja1!$A$1:$H$578,5,FALSE),\" \")","v":"Mecánica"},{"$f":"IFERROR(VLOOKUP(A19,Hoja1!$A$1:$H$578,6,FALSE),\" \")","v":"Muestreo y análisis de compuestos tóxicos en el ambiente"},{"$f":"IFERROR(VLOOKUP(A19,Hoja1!$A$1:$H$578,7,FALSE),\" \")","v":"Dra. Violeta Mugica Álvarez                                                 Dra. Brenda Liz Valle Hernández      Mtra. Griselda González Cardoso         Dr. José de Jesús Figueroa Lara          Dr. Adolfo Hernández Moreno"},{"$f":"IFERROR(VLOOKUP(A19,Hoja1!$A$1:$H$578,8,FALSE),\" \")","v":5553189570}]
[13,{"$f":"VLOOKUP(A20,Hoja1!$A$1:$H$578,3,FALSE)","v":1143},{"$f":"IFERROR(VLOOKUP(A20,Hoja1!$A$1:$H$578,4,FALSE),\" \")","v":"UAM"},{"$f":"IFERROR(VLOOKUP(A20,Hoja1!$A$1:$H$578,5,FALSE),\" \")","v":"Mecánica"},{"$f":"IFERROR(VLOOKUP(A20,Hoja1!$A$1:$H$578,6,FALSE),\" \")","v":"Diseño de prototipos experimentales para sistemas complejos"},{"$f":"IFERROR(VLOOKUP(A20,Hoja1!$A$1:$H$578,7,FALSE),\" \")","v":"Eduardo Basurto Uribe                                          Catalina Ester Haro Pérez                        Armando Gómez Vieyra                       Grethell Georgina Pérez Sánchez         Carlos Alejandro Vargas                    Gerardo Miguel Odriozola Prego                       "},{"$f":"IFERROR(VLOOKUP(A20,Hoja1!$A$1:$H$578,8,FALSE),\" \")","v":"5318-9382                        5318-9020"}]
[14,{"$f":"VLOOKUP(A21,Hoja1!$A$1:$H$578,3,FALSE)","v":1146},{"$f":"IFERROR(VLOOKUP(A21,Hoja1!$A$1:$H$578,4,FALSE),\" \")","v":"UAM"},{"$f":"IFERROR(VLOOKUP(A21,Hoja1!$A$1:$H$578,5,FALSE),\" \")","v":"Mecánica"},{"$f":"IFERROR(VLOOKUP(A21,Hoja1!$A$1:$H$578,6,FALSE),\" \")","v":"Centro de apoyo para docencia e investigación (CADI)"},{"$f":"IFERROR(VLOOKUP(A21,Hoja1!$A$1:$H$578,7,FALSE),\" \")","v":"Dr. Ernesto Rodrigo Vázquez Cerón"},{"$f":"IFERROR(VLOOKUP(A21,Hoja1!$A$1:$H$578,8,FALSE),\" \")","v":"5318-9030"}]
[15,{"$f":"VLOOKUP(A22,Hoja1!$A$1:$H$578,3,FALSE)","v":534},{"$f":"IFERROR(VLOOKUP(A22,Hoja1!$A$1:$H$578,4,FALSE),\" \")","v":"UAM"},{"$f":"IFERROR(VLOOKUP(A22,Hoja1!$A$1:$H$578,5,FALSE),\" \")","v":"Mecánica"},{"$f":"IFERROR(VLOOKUP(A22,Hoja1!$A$1:$H$578,6,FALSE),\" \")","v":"Tratamiento de residuos líquidos mediante procesos electroquímicos y biológicos"},{"$f":"IFERROR(VLOOKUP(A22,Hoja1!$A$1:$H$578,7,FALSE),\" \")","v":"Sergio Martínez Delgadillo                                        Víctor Xiunel Mendoza Escamilla         Dra. Silvia Cristina Iuga"},{"$f":"IFERROR(VLOOKUP(A22,Hoja1!$A$1:$H$578,8,FALSE),\" \")","v":"5318-9007"}]
[16,{"$f":"VLOOKUP(A23,Hoja1!$A$1:$H$578,3,FALSE)","v":1183},{"$f":"IFERROR(VLOOKUP(A23,Hoja1!$A$1:$H$578,4,FALSE),\" \")","v":"UAM"},{"$f":"IFERROR(VLOOKUP(A23,Hoja1!$A$1:$H$578,5,FALSE),\" \")","v":"Mecánica"},{"$f":"IFERROR(VLOOKUP(A23,Hoja1!$A$1:$H$578,6,FALSE),\" \")","v":"Técnicas de visualización para el estudio de micromovimientos"},{"$f":"IFERROR(VLOOKUP(A23,Hoja1!$A$1:$H$578,7,FALSE),\" \")","v":"Dr. Miguel Ángel López Ontiveros"},{"$f":"IFERROR(VLOOKUP(A23,Hoja1!$A$1:$H$578,8,FALSE),\" \")","v":"5318-9000 ext. 2243"}]
[17,{"$f":"VLOOKUP(A24,Hoja1!$A$1:$H$578,3,FALSE)","v":1287},{"$f":"IFERROR(VLOOKUP(A24,Hoja1!$A$1:$H$578,4,FALSE),\" \")","v":"UAM"},{"$f":"IFERROR(VLOOKUP(A24,Hoja1!$A$1:$H$578,5,FALSE),\" \")","v":"Mecánica"},{"$f":"IFERROR(VLOOKUP(A24,Hoja1!$A$1:$H$578,6,FALSE),\" \")","v":"Diseño de materiales sono o foto-activos (TiO2), usados en la degradación de contaminantes"},{"$f":"IFERROR(VLOOKUP(A24,Hoja1!$A$1:$H$578,7,FALSE),\" \")","v":"Marcos May Lozano                                     Ricardo López Medina"},{"$f":"IFERROR(VLOOKUP(A24,Hoja1!$A$1:$H$578,8,FALSE),\" \")","v":"5318-9023"}]
[18,{"$f":"VLOOKUP(A25,Hoja1!$A$1:$H$578,3,FALSE)","v":1388},{"$f":"IFERROR(VLOOKUP(A25,Hoja1!$A$1:$H$578,4,FALSE),\" \")","v":"UAM"},{"$f":"IFERROR(VLOOKUP(A25,Hoja1!$A$1:$H$578,5,FALSE),\" \")","v":"Mecánica"},{"$f":"IFERROR(VLOOKUP(A25,Hoja1!$A$1:$H$578,6,FALSE),\" \")","v":"Análisis numérico y experimental en el proceso de destilación solar"},{"$f":"IFERROR(VLOOKUP(A25,Hoja1!$A$1:$H$578,7,FALSE),\" \")","v":"Mtra. Sandra Chávez Sánchez"},{"$f":"IFERROR(VLOOKUP(A25,Hoja1!$A$1:$H$578,8,FALSE),\" \")","v":"5318-9000"}]
[19,{"$f":"VLOOKUP(A26,Hoja1!$A$1:$H$578,3,FALSE)","v":1395},{"$f":"IFERROR(VLOOKUP(A26,Hoja1!$A$1:$H$578,4,FALSE),\" \")","v":"UAM"},{"$f":"IFERROR(VLOOKUP(A26,Hoja1!$A$1:$H$578,5,FALSE),\" \")","v":"Mecánica"},{"$f":"IFERROR(VLOOKUP(A26,Hoja1!$A$1:$H$578,6,FALSE),\" \")","v":"Tecnologías sustentables enfocadas a agua, suelo y plásticos "},{"$f":"IFERROR(VLOOKUP(A26,Hoja1!$A$1:$H$578,7,FALSE),\" \")","v":"Mtra. Margarita Beltrán Villavicencio                 Dra. Alethia Vázquez Morillas                    Dra. Maribel Velasco Pérez                          Dra. Rosa María Espinosa Valdemar               Dr. Israel Labastida Núñez         Dra. Sylvie Turpin Marion                         Mtra. Griselda González Cardoso                    Dr. José Ángel Dávila Gómez"},{"$f":"IFERROR(VLOOKUP(A26,Hoja1!$A$1:$H$578,8,FALSE),\" \")","v":"5318-9075, 5318-9057, 53189062"}]
[20,{"$f":"VLOOKUP(A27,Hoja1!$A$1:$H$578,3,FALSE)","v":1435},{"$f":"IFERROR(VLOOKUP(A27,Hoja1!$A$1:$H$578,4,FALSE),\" \")","v":"UAM"},{"$f":"IFERROR(VLOOKUP(A27,Hoja1!$A$1:$H$578,5,FALSE),\" \")","v":"Mecánica"},{"$f":"IFERROR(VLOOKUP(A27,Hoja1!$A$1:$H$578,6,FALSE),\" \")","v":"Desarrollo y construcción de un vehículo baja SAE"},{"$f":"IFERROR(VLOOKUP(A27,Hoja1!$A$1:$H$578,7,FALSE),\" \")","v":"Ing. Romy Pérez Moreno"},{"$f":"IFERROR(VLOOKUP(A27,Hoja1!$A$1:$H$578,8,FALSE),\" \")","v":"5318-9069"}]
[21,{"$f":"VLOOKUP(A28,Hoja1!$A$1:$H$578,3,FALSE)","v":1477},{"$f":"IFERROR(VLOOKUP(A28,Hoja1!$A$1:$H$578,4,FALSE),\" \")","v":"UAM"},{"$f":"IFERROR(VLOOKUP(A28,Hoja1!$A$1:$H$578,5,FALSE),\" \")","v":"Mecánica"},{"$f":"IFERROR(VLOOKUP(A28,Hoja1!$A$1:$H$578,6,FALSE),\" \")","v":"Desarrollo de una célula de manufactura con enfoque 4.0"},{"$f":"IFERROR(VLOOKUP(A28,Hoja1!$A$1:$H$578,7,FALSE),\" \")","v":"Lisaura Walkiria Rodríguez Alvarado                                                      Jesús Loyo Quijada                             Dr. Usiel Sandino Silva Rivera"},{"$f":"IFERROR(VLOOKUP(A28,Hoja1!$A$1:$H$578,8,FALSE),\" \")","v":"5318-9532 ext. 146, 112"}]
[22,{"$f":"VLOOKUP(A29,Hoja1!$A$1:$H$578,3,FALSE)","v":1492},{"$f":"IFERROR(VLOOKUP(A29,Hoja1!$A$1:$H$578,4,FALSE),\" \")","v":"UAM"},{"$f":"IFERROR(VLOOKUP(A29,Hoja1!$A$1:$H$578,5,FALSE),\" \")","v":"Mecánica"},{"$f":"IFERROR(VLOOKUP(A29,Hoja1!$A$1:$H$578,6,FALSE),\" \")","v":"Fabricación y caracterización de nuevos materiales compuestos para posibles implantes en el cuerpo humano (huesos)"},{"$f":"IFERROR(VLOOKUP(A29,Hoja1!$A$1:$H$578,7,FALSE),\" \")","v":"Dra. María Elizabeth Refugio García"},{"$f":"IFERROR(VLOOKUP(A29,Hoja1!$A$1:$H$578,8,FALSE),\" \")","v":"5318-9000 ext. 2130"}]
[23,{"$f":"VLOOKUP(A30,Hoja1!$A$1:$H$578,3,FALSE)","v":1497},{"$f":"IFERROR(VLOOKUP(A30,Hoja1!$A$1:$H$578,4,FALSE),\" \")","v":"UAM"},{"$f":"IFERROR(VLOOKUP(A30,Hoja1!$A$1:$H$578,5,FALSE),\" \")","v":"Mecánica"},{"$f":"IFERROR(VLOOKUP(A30,Hoja1!$A$1:$H$578,6,FALSE),\" \")","v":"Comportamiento de estructuras de concreto"},{"$f":"IFERROR(VLOOKUP(A30,Hoja1!$A$1:$H$578,7,FALSE),\" \")","v":"Dr. Eduardo Arellano Mendez                   Dr. Hans Israel Archundia Aranda             M. I. Gilberto Rangel Torres"},{"$f":"IFERROR(VLOOKUP(A30,Hoja1!$A$1:$H$578,8,FALSE),\" \")","v":53189461}]
{"$rows_left_out":875}
{"sheet":"NOTA","index":2,"n_rows":0,"n_cols":0,"rows_kept":0,"cut":false,"hidden":false,"merged":[]}